{"text_format":"1","workbook":"xlsx","n_sheets":6,"sheets":["Instructions & Explanatory Note","Fund Information","Investor Information","JSON","Errors","Limits"],"not_rendered":{"charts":0,"images":1,"macros":1,"external_links":1,"defined_names":2,"comments":0,"pivot_tables":0},"unopened":[],"bounds":{"document_bytes":16777216,"sheet_cells":100000,"rows_first":2000,"rows_last":500,"rows_between":2000,"halvings":0,"cell_chars":16384,"cell_head_chars":4096},"cells_cut":0,"cells_raw":0,"read":"whole","date_system":"1900"}

{"sheet":"Instructions & Explanatory Note","index":0,"n_rows":104,"n_cols":3,"rows_kept":104,"cut":false,"hidden":false,"merged":[[99,1,102,1],[99,2,102,11],[103,1,106,1],[103,2,106,11],[5,1,21,9],[27,1,28,6],[31,1,32,3],[93,1,94,11],[95,1,98,1],[95,2,98,11],[35,1,36,11],[37,1,44,1],[37,2,44,11],[45,1,46,1],[45,2,46,11],[47,1,49,1],[47,2,49,11],[50,1,54,1],[50,2,54,11],[55,1,58,1],[55,2,58,11],[59,1,62,1],[59,2,62,11],[68,1,69,11],[70,1,73,1],[70,2,73,11],[85,1,87,1],[85,2,87,11],[74,1,77,1],[74,2,77,11],[78,1,81,1],[78,2,81,11],[82,1,84,1],[82,2,84,11]]}
[]
[]
[null,"Instructions & Explanatory Notes for the IF Return"]
[]
[]
[null,"Explanatory Note on the completion of Form IF – Investment Fund Return of Information\nThis form is required for the purposes of section 508J(2) and 508J(3) TCA 1997\n\nPersons who should make this return\nThis return is relevant to the managers of a Designated Investment Fund, Investment Limited Partnership and Limited Partnership who have received a Statement of Qualification from a qualifying company in respect of eligible shares issued to them as nominees for the individual investor to which relief under Part 16, Taxes Consolidation Act (TCA) 1997 may apply.\nSection 508J(2) TCA 1997 requires that the managers of a investment fund which have received Statements of Qualification in relation to the holdings of eligible shares by companies, provides the Revenue Commissioners with the information set out in this return. \n\nHow to make this return\nFrom IF can be downloaded in a spreadsheet format from the Revenue website and should be filed using the ‘MyEnquiries’ facility on www.revenue.ie to eiiadmin@revenue.ie. To file the return in ROS you must be registered for SSR. Business customers who have a ROS digital certificate will be able to access ‘MyEnquiries’ through their ROS account. Business customers who do not have an active ROS digital certificate can either register for ‘MyAccount’ or register for ROS in order to use the ‘MyEnquiries’ service. Further details are abailable on the Revenue website.\n\nWhen this return should be filed\nA manager of a designated fund must file this return within 30 days of having received a Statement of Qualification from a company. \nThe first time a Statement of Qualification is received, this return must be submitted. Each time a susequent Statement of Qualification is received, this return must be downloaded from the most recent ROS submission, amended with the latest information and re-submitted via ROS.\n\nPenalties\nThe law provides for penalties for failure to make a complete and accurate return. The penalty for failing to furnish any of the information required by this return is €2,000 plus €50 per day.\n\nAudit\nThis return may be subject to an Audit by a Revenue official. The law provides that a Revenue official may make enquiries or take such actions as are considered necessary to verify the accuracy of a return.\n\nAccessibility\nIf you are a person with a disability and require this leaflet in an alternative format, the Revenue Access Officer can be contacted at: accessofficer@revenue.ie.\n"]
[]
[]
[]
[]
[]
[]
[]
[]
[]
[]
[]
[]
[]
[]
[]
[]
[]
[]
[null,"How to Use the Form IF Return Tool"]
[]
[]
[null,"The Form IF Return Tool is a customised spreadsheet that allows filers to record IF Return data.\nOnce completed, the filer should click the 'Convert to ZIP file for Upload' button to convert the data entered into a ZIP file. \nThe ZIP file produced must be uploaded to Revenue via ROS to complete the submission of the IF Return.\n\nThis file is only compatible on a Windows Operating System through the use of Microsoft Excel."]
[]
[]
[]
[null,"If you experience any technical issues filling out this form, click the Refresh button. If an issue persists then submit an Enquiry through MyEnquiries in ROS."]
[]
[]
[]
[null,"      Steps to Complete the Form IF"]
[]
[null,1,"Upon opening the Form IF Return Tool, please ensure that macros are enabled as they are necessary to use the Return Tool.\nIf Macros are disabled, it will be highlighted at the top of the sheet. \n\n\n\n\n\n\nClick on the 'Enable Content' button to enable macros."]
[]
[]
{"$rows_left_out":65}
{"sheet":"Fund Information","index":1,"n_rows":50,"n_cols":18,"rows_kept":50,"cut":false,"hidden":false,"merged":[[12,0,12,1],[0,2,0,10],[3,0,3,4],[4,0,4,2],[4,3,4,4],[5,0,5,1],[5,3,5,4],[3,6,21,9],[18,0,18,1],[6,0,6,1],[6,3,6,4],[7,0,7,1],[13,0,13,1],[13,3,13,4],[9,0,9,1],[10,0,10,1],[20,0,20,1],[14,0,14,1],[14,3,14,4],[15,0,15,1],[15,3,15,4],[16,0,16,1],[16,3,16,4],[1,0,1,1],[27,2,27,16],[10,3,10,4],[19,0,19,1],[19,3,19,4],[21,0,21,1],[21,3,21,4],[22,0,22,1],[22,3,22,4],[23,0,23,1],[23,3,23,4],[17,0,17,1],[9,3,9,4],[8,0,8,1],[8,3,8,4],[11,0,11,2],[24,3,24,4],[28,2,28,7],[28,8,28,10],[1,2,1,16],[28,14,28,16],[11,3,11,4],[28,11,28,13],[7,3,7,4],[20,3,20,4],[18,3,18,4],[17,3,17,4],[12,3,12,4]]}
[null,null,"  Form IF - Return of Information of Investment Fund - Version 22.7\n  Please ensure that you read the Instructions tab before completing this spread sheet."]
[null,null,"  Fund Information"]
[]
[" Investment Fund Details",null,null,null,null,null,"How to Complete the Form IF\n\n1. Complete the Investment Fund Details (top) section. \n      •  Correct any errors before entering any line-item details in either the Fund Information or Investor Information tabs.\n\n2. Enter the line-items related to Investments Made by the Fund below. \n      •  If the Row Status changes to \"Errors\", check the errors for that line by clicking on the 'Check Errors' link.\n\n3. Once all errors have been corrected and all line-items are indicated as Valid, press the 'Convert to ZIP file for Upload' button. \n     •  This will generate a ZIP File which you must then upload to ROS.\n\n4.  Log into ROS. The filer must be registered for SSR (Share Schemes Reporting) before submitting the IF Return.\n      •  Navigate to 'Manage Reporting Obligations' in Other Services to complete this registration.\n\n     Once registered, navigate to 'Complete a Form Online', choose the 'Reporting Obligation' radio button and choose 'SSR'.\n      •  In the adjacent 'Type' dropdown, choose 'IF' and then 'Submit'. Choose the Return Year that the return is being submitted for.\n\n5. Click Add Files and browse to the location of your previously generated ZIP File and select it for upload. \n      •  The filename must look like the following: IF_1234567T_2019_1230.ZIP\n          DO NOT upload the original 'Form IF' Excel spreadsheet.\n\n6. If your upload has been successful, you will receive a successful upload message. \n      •  The filer will receive a ROS Inbox Notification with a PDF package containing the Manager's Certs that should be issued to the fund's investors.\n      •  The filer must complete the remaining fields and sign the Statements of Qualification before issuing them. "]
["Manager Details",null,null,"Manager Details Status"]
["Name of Investment Fund Manager*",null,null,{"$f":"checkTextField(A6,C6)","v":"Error: This is a required field."}]
["Manager Tax Reference Number*",null,null,{"$f":"PPSNumberHeader(C7,A7)","v":"Error: Manager Tax Reference Number* is a required field"}]
["Address of Investment Fund Manager*",null,null,{"$f":"checkTextField(A8,C8)","v":"Error: This is a required field."}]
["Eircode*",null,null,{"$f":"checkTextField(A9,C9)","v":"Error: This is a required field."}]
["Email Address*",null,null,{"$f":"checkTextField(A10,C10)","v":"Error: This is a required field."}]
["Telephone Number*",null,null,{"$f":"checkTextField(A11,C11)","v":"Error: This is a required field."}]
[" Investment Fund Details",null,null," Investment Fund Status"]
["Type of Investment Fund*",null,null,{"$f":"checkTextField(A13,C13)","v":"Error: This is a required field."}]
["Name of Investment Fund*",null,null,{"$f":"checkTextField(A14,C14)","v":"Error: This is a required field."}]
["Tax Reference Number*",null,null,{"$f":"PPSNumberHeader(C15,A15)","v":"Error: Tax Reference Number* is a required field"}]
["Return Year*",null,null,{"$f":"checkTextField(A16,C16)","v":"Error: This is a required field."}]
["Address of Investment Fund*",null,null,{"$f":"checkTextField(A17,C17)","v":"Error: This is a required field."}]
["Eircode of Investment Fund*",null,null,{"$f":"checkTextField(A18,C18)","v":"Error: This is a required field."}]
["Is the Fund a Closed Fund?*",null,null,{"$f":"checkTextField(A19,C19)","v":"Error: This is a required field."}]
["Fund Date (Closing)",null,null,{"$f":"IF(C16>0,IF(C19>0,checkTextField(A20,C20),\"\"),\"\")","v":""}]
["Name of Nominee Shareholder (in the case of a DIF) or Depository (in the case of a QIF)*",null,null,{"$f":"checkTextField(A21,C21)","v":"Error: This is a required field."}]
["Tax Reference Number of Nominee Shareholder (in the case of a DIF) or Depository (in the case of a QIF)*",null,null,{"$f":"PPSNumberHeader(C22,A22)","v":"Error: Tax Reference Number of Nominee Shareholder (in the case of a DIF) or Depository (in the case of a QIF)* is a required field"}]
["Amount Raised by the Fund*",null,null,{"$f":"checkTextField(A23,C23)","v":"Error: This is a required field."}]
["Investments Made by the Fund*",null,null,{"$f":"checkTextField(A24,C24)","v":"Error: This is a required field."}]
[]
[]
[]
[null,null,"Investments Made by the Fund"]
[null,null,"Company Details",null,null,null,null,null,"Shares Information",null,null,"Investment Information",null,null,"Statement of Qualification"]
["Row Status",null,"Company Name*","Tax Reference Number*","Address 1*","Address 2*","Address 3*","Eircode","Date Fund Subscribed for Shares in Company*","Class of Shares*","Number of Shares*","Date of Investment*","Amount Invested*","For investments up to and including 31 December 2021, date 30% of the funds raised were spent on a qualifying purpose","Statement of Qualification received? (Y/N)*","Date of Statement","Amount of investment which qualifies for relief under Section 502(2)(a)","PPSN Check"]
[{"$f":"IFERROR(checkFundInfoErrors(C31,D31,E31,F31,G31,H31,I31,J31,K31,L31,M31,N31,O31,P31,Q31,R31),\"\")","v":""},"Check Errors",null,null,null,null,null,null,null,null,null,null,null,null,null,null,null,{"$f":"IFERROR(VLOOKUP(D31,'Investor Information'!E$13:E$1512,TRUE,FALSE),\"\")","v":""}]
[{"$f":"IFERROR(checkFundInfoErrors(C32,D32,E32,F32,G32,H32,I32,J32,K32,L32,M32,N32,O32,P32,Q32,R32),\"\")","v":""},"Check Errors",null,null,null,null,null,null,null,null,null,null,null,null,null,null,null,{"$f":"IFERROR(VLOOKUP(D32,'Investor Information'!E$13:E$1512,TRUE,FALSE),\"\")","v":""}]
[{"$f":"IFERROR(checkFundInfoErrors(C33,D33,E33,F33,G33,H33,I33,J33,K33,L33,M33,N33,O33,P33,Q33,R33),\"\")","v":""},"Check Errors",null,null,null,null,null,null,null,null,null,null,null,null,null,null,null,{"$f":"IFERROR(VLOOKUP(D33,'Investor Information'!E$13:E$1512,TRUE,FALSE),\"\")","v":""}]
[{"$f":"IFERROR(checkFundInfoErrors(C34,D34,E34,F34,G34,H34,I34,J34,K34,L34,M34,N34,O34,P34,Q34,R34),\"\")","v":""},"Check Errors",null,null,null,null,null,null,null,null,null,null,null,null,null,null,null,{"$f":"IFERROR(VLOOKUP(D34,'Investor Information'!E$13:E$1512,TRUE,FALSE),\"\")","v":""}]
[{"$f":"IFERROR(checkFundInfoErrors(C35,D35,E35,F35,G35,H35,I35,J35,K35,L35,M35,N35,O35,P35,Q35,R35),\"\")","v":""},"Check Errors",null,null,null,null,null,null,null,null,null,null,null,null,null,null,null,{"$f":"IFERROR(VLOOKUP(D35,'Investor Information'!E$13:E$1512,TRUE,FALSE),\"\")","v":""}]
[{"$f":"IFERROR(checkFundInfoErrors(C36,D36,E36,F36,G36,H36,I36,J36,K36,L36,M36,N36,O36,P36,Q36,R36),\"\")","v":""},"Check Errors",null,null,null,null,null,null,null,null,null,null,null,null,null,null,null,{"$f":"IFERROR(VLOOKUP(D36,'Investor Information'!E$13:E$1512,TRUE,FALSE),\"\")","v":""}]
[{"$f":"IFERROR(checkFundInfoErrors(C37,D37,E37,F37,G37,H37,I37,J37,K37,L37,M37,N37,O37,P37,Q37,R37),\"\")","v":""},"Check Errors",null,null,null,null,null,null,null,null,null,null,null,null,null,null,null,{"$f":"IFERROR(VLOOKUP(D37,'Investor Information'!E$13:E$1512,TRUE,FALSE),\"\")","v":""}]
[{"$f":"IFERROR(checkFundInfoErrors(C38,D38,E38,F38,G38,H38,I38,J38,K38,L38,M38,N38,O38,P38,Q38,R38),\"\")","v":""},"Check Errors",null,null,null,null,null,null,null,null,null,null,null,null,null,null,null,{"$f":"IFERROR(VLOOKUP(D38,'Investor Information'!E$13:E$1512,TRUE,FALSE),\"\")","v":""}]
[{"$f":"IFERROR(checkFundInfoErrors(C39,D39,E39,F39,G39,H39,I39,J39,K39,L39,M39,N39,O39,P39,Q39,R39),\"\")","v":""},"Check Errors",null,null,null,null,null,null,null,null,null,null,null,null,null,null,null,{"$f":"IFERROR(VLOOKUP(D39,'Investor Information'!E$13:E$1512,TRUE,FALSE),\"\")","v":""}]
[{"$f":"IFERROR(checkFundInfoErrors(C40,D40,E40,F40,G40,H40,I40,J40,K40,L40,M40,N40,O40,P40,Q40,R40),\"\")","v":""},"Check Errors",null,null,null,null,null,null,null,null,null,null,null,null,null,null,null,{"$f":"IFERROR(VLOOKUP(D40,'Investor Information'!E$13:E$1512,TRUE,FALSE),\"\")","v":""}]
{"$rows_left_out":11}
{"sheet":"Investor Information","index":2,"n_rows":1512,"n_cols":14,"rows_kept":1512,"cut":false,"hidden":false,"merged":[[0,2,0,10],[9,2,10,12],[3,2,7,11]]}
[null,null,"  Form IF - Return of Information of Investment Fund - Version 22.7\n  Please ensure that you read the Instructions tab before completing this spread sheet."]
[null,null,"  Investor Information"]
[]
[null,null,"How to Complete the Form IF\n1. Complete the Investment Fund Details (top) section. \n      •  Correct any errors before entering any line-item details in either the Fund Information or Investor Information tabs.\n\n2. Enter the line-items related to Investments Made by the Fund below. \n      •  If the Row Status changes to \"Errors\", check the errors for that line by clicking on the 'Check Errors' link.\n\n3. Once all errors have been corrected and all line-items are indicated as Valid, press the 'Convert to ZIP file for Upload' button on the Fund Information tab. \n     •  This will generate a ZIP File which you must then upload to ROS."]
[]
[]
[]
[]
[]
[null,null,"Investor Information"]
[]
["Row Status",null,"First Name *","Surname*","PPS Number*","Address 1*","Address 2","Address 3","Address 4","Eircode","Date Investor Subscribes in Fund*","Amount Invested in the Fund*","Elect to Invest*","Duplicate"]
[{"$f":"IFERROR(checkInvestorInfoErrors(C13,D13,E13,F13,G13,H13,I13,J13,K13,L13,M13,N13),\"\")","v":""},"Check Errors",null,null,null,null,null,null,null,null,null,null,null,{"$f":"IF(COUNTIF($E$13:$E$1512, E13)>1, \"Duplicate\",\"\")","v":""}]
[{"$f":"IFERROR(checkInvestorInfoErrors(C14,D14,E14,F14,G14,H14,I14,J14,K14,L14,M14,N14),\"\")","v":""},"Check Errors",null,null,null,null,null,null,null,null,null,null,null,""]
[{"$f":"IFERROR(checkInvestorInfoErrors(C15,D15,E15,F15,G15,H15,I15,J15,K15,L15,M15,N15),\"\")","v":""},"Check Errors",null,null,null,null,null,null,null,null,null,null,null,""]
[{"$f":"IFERROR(checkInvestorInfoErrors(C16,D16,E16,F16,G16,H16,I16,J16,K16,L16,M16,N16),\"\")","v":""},"Check Errors",null,null,null,null,null,null,null,null,null,null,null,""]
[{"$f":"IFERROR(checkInvestorInfoErrors(C17,D17,E17,F17,G17,H17,I17,J17,K17,L17,M17,N17),\"\")","v":""},"Check Errors",null,null,null,null,null,null,null,null,null,null,null,""]
[{"$f":"IFERROR(checkInvestorInfoErrors(C18,D18,E18,F18,G18,H18,I18,J18,K18,L18,M18,N18),\"\")","v":""},"Check Errors",null,null,null,null,null,null,null,null,null,null,null,""]
[{"$f":"IFERROR(checkInvestorInfoErrors(C19,D19,E19,F19,G19,H19,I19,J19,K19,L19,M19,N19),\"\")","v":""},"Check Errors",null,null,null,null,null,null,null,null,null,null,null,""]
[{"$f":"IFERROR(checkInvestorInfoErrors(C20,D20,E20,F20,G20,H20,I20,J20,K20,L20,M20,N20),\"\")","v":""},"Check Errors",null,null,null,null,null,null,null,null,null,null,null,""]
[{"$f":"IFERROR(checkInvestorInfoErrors(C21,D21,E21,F21,G21,H21,I21,J21,K21,L21,M21,N21),\"\")","v":""},"Check Errors",null,null,null,null,null,null,null,null,null,null,null,""]
[{"$f":"IFERROR(checkInvestorInfoErrors(C22,D22,E22,F22,G22,H22,I22,J22,K22,L22,M22,N22),\"\")","v":""},"Check Errors",null,null,null,null,null,null,null,null,null,null,null,""]
[{"$f":"IFERROR(checkInvestorInfoErrors(C23,D23,E23,F23,G23,H23,I23,J23,K23,L23,M23,N23),\"\")","v":""},"Check Errors",null,null,null,null,null,null,null,null,null,null,null,""]
[{"$f":"IFERROR(checkInvestorInfoErrors(C24,D24,E24,F24,G24,H24,I24,J24,K24,L24,M24,N24),\"\")","v":""},"Check Errors",null,null,null,null,null,null,null,null,null,null,null,""]
[{"$f":"IFERROR(checkInvestorInfoErrors(C25,D25,E25,F25,G25,H25,I25,J25,K25,L25,M25,N25),\"\")","v":""},"Check Errors",null,null,null,null,null,null,null,null,null,null,null,""]
[{"$f":"IFERROR(checkInvestorInfoErrors(C26,D26,E26,F26,G26,H26,I26,J26,K26,L26,M26,N26),\"\")","v":""},"Check Errors",null,null,null,null,null,null,null,null,null,null,null,""]
[{"$f":"IFERROR(checkInvestorInfoErrors(C27,D27,E27,F27,G27,H27,I27,J27,K27,L27,M27,N27),\"\")","v":""},"Check Errors",null,null,null,null,null,null,null,null,null,null,null,""]
[{"$f":"IFERROR(checkInvestorInfoErrors(C28,D28,E28,F28,G28,H28,I28,J28,K28,L28,M28,N28),\"\")","v":""},"Check Errors",null,null,null,null,null,null,null,null,null,null,null,""]
[{"$f":"IFERROR(checkInvestorInfoErrors(C29,D29,E29,F29,G29,H29,I29,J29,K29,L29,M29,N29),\"\")","v":""},"Check Errors",null,null,null,null,null,null,null,null,null,null,null,""]
[{"$f":"IFERROR(checkInvestorInfoErrors(C30,D30,E30,F30,G30,H30,I30,J30,K30,L30,M30,N30),\"\")","v":""},"Check Errors",null,null,null,null,null,null,null,null,null,null,null,""]
[{"$f":"IFERROR(checkInvestorInfoErrors(C31,D31,E31,F31,G31,H31,I31,J31,K31,L31,M31,N31),\"\")","v":""},"Check Errors",null,null,null,null,null,null,null,null,null,null,null,""]
[{"$f":"IFERROR(checkInvestorInfoErrors(C32,D32,E32,F32,G32,H32,I32,J32,K32,L32,M32,N32),\"\")","v":""},"Check Errors",null,null,null,null,null,null,null,null,null,null,null,""]
[{"$f":"IFERROR(checkInvestorInfoErrors(C33,D33,E33,F33,G33,H33,I33,J33,K33,L33,M33,N33),\"\")","v":""},"Check Errors",null,null,null,null,null,null,null,null,null,null,null,""]
[{"$f":"IFERROR(checkInvestorInfoErrors(C34,D34,E34,F34,G34,H34,I34,J34,K34,L34,M34,N34),\"\")","v":""},"Check Errors",null,null,null,null,null,null,null,null,null,null,null,""]
[{"$f":"IFERROR(checkInvestorInfoErrors(C35,D35,E35,F35,G35,H35,I35,J35,K35,L35,M35,N35),\"\")","v":""},"Check Errors",null,null,null,null,null,null,null,null,null,null,null,""]
[{"$f":"IFERROR(checkInvestorInfoErrors(C36,D36,E36,F36,G36,H36,I36,J36,K36,L36,M36,N36),\"\")","v":""},"Check Errors",null,null,null,null,null,null,null,null,null,null,null,""]
[{"$f":"IFERROR(checkInvestorInfoErrors(C37,D37,E37,F37,G37,H37,I37,J37,K37,L37,M37,N37),\"\")","v":""},"Check Errors",null,null,null,null,null,null,null,null,null,null,null,""]
[{"$f":"IFERROR(checkInvestorInfoErrors(C38,D38,E38,F38,G38,H38,I38,J38,K38,L38,M38,N38),\"\")","v":""},"Check Errors",null,null,null,null,null,null,null,null,null,null,null,""]
[{"$f":"IFERROR(checkInvestorInfoErrors(C39,D39,E39,F39,G39,H39,I39,J39,K39,L39,M39,N39),\"\")","v":""},"Check Errors",null,null,null,null,null,null,null,null,null,null,null,""]
[{"$f":"IFERROR(checkInvestorInfoErrors(C40,D40,E40,F40,G40,H40,I40,J40,K40,L40,M40,N40),\"\")","v":""},"Check Errors",null,null,null,null,null,null,null,null,null,null,null,""]
{"$rows_left_out":1473}
{"sheet":"JSON","index":3,"n_rows":57,"n_cols":1,"rows_kept":57,"cut":false,"hidden":true,"merged":[]}
["difVersion"]
["DesignatedInvestmentFundDetails"]
["managerDetails"]
["nameOfDesignatedInvestmentFundManager"]
["managerTaxReferenceNumber"]
["addressOfDesignatedInvestmentFundManager"]
["eircodeManager"]
["fundDetails"]
["nameOfDesignatedInvestmentFund"]
["fundTaxReferenceNumber"]
["returnYear"]
["addressOfDesignatedInvestmentFund"]
["eircodeFund"]
["isTheFundAClosedFund"]
["fundDateClosing"]
["nameOfNomineeShareholder"]
["taxReferenceNumberOfNomineeShareholder"]
["amountRaisedByTheFundTotal"]
["investmentsMadeByFundTotal"]
["investmentsMadeByTheFund"]
["companyDetails"]
["companyName"]
["companyTaxReferenceNumber"]
["address1"]
["address2"]
["address3"]
["eircodeCompany"]
["sharesInformation"]
["dateFundSubscribedForSharesInCompany"]
["classOfShares"]
["numberOfShares"]
["investmentInformation"]
["dateOfInvestment"]
["amountInvested"]
["date30PercentRaisedExpended"]
["statementOfQualification"]
["statementOfQualificationReceived"]
["dateOfStatement"]
["amountOfInvestmentWhichQualifiesForReliefUnderSection5022a"]
["investorInformation"]
{"$rows_left_out":18}
{"sheet":"Errors","index":4,"n_rows":77,"n_cols":1,"rows_kept":77,"cut":false,"hidden":true,"merged":[]}
["Valid"]
["This is a required field."]
["cannot exceed 80 characters."]
["cannot be numeric."]
["must be numeric."]
["must be in the expected format. (e.g. A12B3C4)"]
["must be in the correct format."]
["must contain 'Y' or 'N'."]
["cannot be earlier than"]
["cannot be greater than"]
["must be in the format DD/MM/YYYY"]
["Investor Information section is incomplete. Please complete the required fields (indicated with *) for this line-item."]
["• First Name cannot be numeric."]
["• First Name cannot exceed 25 characters."]
["• Surname cannot be numeric."]
["• Surname cannot exceed 40 characters."]
["• Address 1 cannot be numeric."]
["• Address 1 cannot exceed 160 characters."]
["• Address 2 cannot be numeric."]
["• Address 2 cannot exceed 60 characters."]
["• Address 3 cannot be numeric."]
["• Address 3 cannot exceed 60 characters"]
["• Address 4 cannot be numeric."]
["• Address 4 cannot exceed 60 characters."]
["• Amount Invested in the Fund must be numeric."]
["• Eircode must be in the expected format. (e.g. A12B3C4)."]
["• PPS Number must be in the correct format (e.g. 1234567T or 123456FA)."]
["• PPS Number cannot be the same as the Manager's Tax Reference Number in the Manager's Details section. Please amend the PPS Number for this line-item."]
["• PPS Number cannot be the same as the Fund's Tax Reference Number in the Investment Fund Details section. Please amend the PPS Number for this line-item."]
["• PPS Number cannot be the same as the Nominee Shareholder's Tax Reference Number in the Investment Fund Details section. Please amend the PPS Number for this line-item."]
["• Date Investor Subscribes in the Fund must be in the format DD/MM/YYYY."]
["• Date Investor Subscribes in the Fund cannot be earlier than"]
["• Date Investor Subscribes in the Fund cannot be greater than"]
["• The Investor PPS Number entered on this line-item cannot be repeated, please edit the PPS Number on this line-item. If an investor has made multiple investments in the Investment Fund, please enter the sum of these investments as one line-item."]
["• Company Details section is incomplete. Please complete the required fields (indicated with *) for this line-item."]
["• Shares Information section is incomplete. Please complete the required fields (indicated with *) for this line-item."]
["• Investment Information section is incomplete. Please complete the required fields (indicated with *) for this line-item."]
["• Company Name cannot be numeric."]
["• Company Name cannot exceed 80 characters."]
["• Address 1 cannot be numeric."]
{"$rows_left_out":38}
{"sheet":"Limits","index":5,"n_rows":54,"n_cols":10,"rows_kept":54,"cut":false,"hidden":true,"merged":[]}
[null,null,null,"Return Year List","Current Year","Current Year (used)","Limits",null,"Dropdown","Elect"]
["Manager Details",null,null,{"$f":"IF((($F$2))>=G2,IF((($F$2)-1)<=G3,($F$2),\"\"))","v":2023},{"$f":"YEAR(TODAY())","v":2023},{"$f":"IF(E2<=2019,2019,IF(E2>2027,2027,YEAR(TODAY())))","v":2023},2019,null,"Y","Minimum of 4 Years"]
["Name of Investment Fund Manager*",80,{"$f":"IF((D2<>\"\"),IF((D2)>$G$2,(D2-1),\"\"),\"\")","v":2022},{"$f":"IF((D2<>\"\"),IF((D2)>$G$2,(D2-1),\"\"),\"\")","v":2022},null,null,2027,null,"N","Minimum of 7 Years"]
["Tax Reference Number*",9,null,2021]
["Address of Investment Fund Manager*",160,null,2020]
["Eircode*",7,null,2019]
["Email Address*",160,null,""]
["Telephone Number*",40,null,""]
["Investment Fund Details",null,null,""]
["Name of Investment Fund*",160]
["Tax Reference Number*",9]
["Return Year",4]
["Address of Investment Fund*",160]
["Eircode*",7]
["Is the Fund a Closed Fund?"]
["Fund Date (Closing)"]
["Name of Nominee Shareholder",80]
["Tax Reference Number of Nominee Shareholder",9]
["Amount Raised by the Fund"]
["Investments Made by the Fund"]
[]
["Investments Made by the Fund"]
["Company Name",80]
["Tax Reference Number",9]
["Address 1*",160]
["Address 2*",60]
["Address 3*",60]
["Eircode",7]
["Date Fund Subscribed for Shares in Company"]
["Class of Shares",80]
["Number of Shares"]
["Date of Investment"]
["Amount Invested"]
["For investments up to and including 31 December 2021, date 30% of the funds raised were spent on a qualifying purpose"]
["Statement of Qualification received? (Y/N)"]
["Date of Statement"]
["Amount of investment which qualifies for relief under Section 502(2)(a)"]
[]
["Investment Information"]
["First Name *",25]
{"$rows_left_out":14}